{"text_format":"3","workbook":"xlsx","n_sheets":2,"sheets":["Empresas e Instituciones","Listas"],"not_rendered":{"images":1,"defined_names":2,"comments":2},"read":"whole","date_system":"1900"}

{"sheet":"Empresas e Instituciones","index":0,"n_rows":39,"n_cols":10,"rows_kept":39,"merged":[[2,3,3,7],[4,3,4,7],[7,2,7,9],[8,2,8,4],[8,5,8,9],[9,3,9,5],[9,6,9,8],[10,2,10,5],[10,6,10,9],[11,3,11,5],[11,7,11,9],[12,3,12,7],[14,2,14,9],[15,2,15,3],[15,4,15,9],[16,2,16,3],[16,4,16,5],[16,6,16,7],[16,8,16,9],[17,3,17,9],[18,2,18,3],[18,4,18,9],[19,2,19,4],[19,5,19,6],[19,7,19,9],[20,3,20,4],[20,5,20,6],[20,7,20,9],[21,2,22,3],[21,4,22,6],[21,8,22,8],[21,9,22,9],[23,2,23,4],[23,5,23,6],[23,8,23,9],[25,2,25,9],[26,2,26,6],[26,7,26,9],[27,2,27,5],[27,6,27,9],[28,2,28,4],[28,5,28,6],[28,7,28,8],[29,2,29,4],[29,5,29,9],[30,2,30,9],[32,2,32,9],[33,2,33,9],[34,2,34,9],[35,2,35,9],[36,2,36,4],[36,5,36,8],[38,3,38,4],[38,5,38,6],[38,7,38,9]]}
[]
[]
[{"$nulls":3},"FORMULARIO ÚNICO PARA SOLICITAR LA CREACIÓN DE SUBCUENTAS VALOR EN EL DCV-BCE",{"$nulls":4},"           Código:","F-SDCV-003 "]
[{"$nulls":8},"           Fecha: ","Agosto-2025"]
[{"$nulls":3},"(PARA EMPRESAS E INSTITUCIONES)",{"$nulls":4},"           Versión:","4.0"]
[]
[]
[null,null,"DATOS GENERALES DEL DEPOSITANTE DIRECTO"]
[null,null,"NOMBRE DEL DEPOSITANTE DIRECTO:"]
[null,null,"RUC:",{"$f":"IFERROR(VLOOKUP($F$9,Listas!F3:H89,2,0),\"\")","v":""},null,null,"CÓDIGO CASA DE VALORES:",null,null,{"$f":"IFERROR(VLOOKUP($F$9,Listas!F3:H89,3,0),\"\")","v":""}]
[null,null,"PERSONA AUTORIZADA A DAR INSTRUCCIONES:"]
[null,null,"TELÉFONO:",{"$nulls":3},"CELULAR:"]
[null,null,"CORREO:"]
[]
[null,null,"DATOS REFERENCIALES DEL COMITENTE"]
[null,null,"RAZÓN SOCIAL:"]
[null,null,"TIPO IDENTIFICACIÓN:",null,"RUC",null,"NRO. RUC:"]
[null,null,"DIRECCIÓN:"]
[null,null,"REPRESENTANTE LEGAL:"]
[null,null,"IDENTIFICACIÓN REP. LEGAL:"]
[null,null,"CELULAR RL:",null,null,"CORREO ELECTRÓNICO:"]
[null,null,"INSTITUCIÓN FINANCIERA:",{"$nulls":4},"CÓD. IF.","TIPO DE CUENTA"]
[{"$nulls":7},{"$f":"IFERROR(VLOOKUP(E22,Listas!N3:O146,2,0),\"\")","v":""}]
[null,null,"PAIS DONDE RECIBE LOS PAGOS:",{"$nulls":4},"NRO. CTA.:"]
[]
[null,null,"DATOS DE RESIDENCIA FISCAL DEL COMITENTE - ANEXO CRS SOLICITADO POR EL SRI"]
[null,null,"EL PAÍS DE RESIDENCIA FISCAL ES DIFERENTE A ECUADOR?\nNota Importante: Si la respuesta es SI, es obligatorio llenar los datos:"]
[null,null,"PAÍS/PAISES DE RESIDENCIA FISCAL DIFERENTE A EC :"]
[null,null,"NRO. IDENTIFICACIÓN FISCAL:",{"$nulls":4},"FECHA NACIMIENTO:"]
[null,null,"DIRECCIÓN DE RESIDENCIA FISCAL:"]
[null,null,"Nota: Si dispone de más de una residencia fiscal diferente a Ecuador, debe presentar el Anexo Adicional CRS - SRI."]
[]
[null,null,"CONSIDERACIONES:"]
[null,null,"• LOS VALORES QUE SE NEGOCIARÁN A TRAVÉS DEL DCV-BCE SON DE ORIGEN LÍCITO.\t"]
[null,null,"• LA DEBIDA DILIGENCIA E  INFORMACIÓN PROPORCIONADA EN ESTE FORMULARIO ES DE ESTRICTA RESPONSABILIDAD DE LA CASA DE VALORES."]
[null,null,"• EL FORMULARIO FIRMADO ELECTRÓNICAMENTE DEBE REMITIRSE AL CORREO DCV@BCE.EC"]
[null,null,"FIRMA DE LA PERSONA AUTORIZADA:"]
[]
[null,null,"LUGAR:",null,null,"FECHA DE SOLICITUD:",null,{"$f":"TODAY()","v":"2025-09-05"}]

{"sheet":"Listas","index":1,"n_rows":255,"n_cols":17,"rows_kept":255,"hidden":true,"merged":[[1,5,1,8],[1,13,1,16]]}
[]
[{"$nulls":5},"DEPOSITANTE DIRECTO",{"$nulls":7},"INSTITUCIONES FINANCIERAS"]
[null,"ESTADO CIVIL","IDENTIFICACIÓN","TIPO DE CUENTA","CONFIRMACIÓN","RAZÓN SOCIAL","RUC","CÓDIGO CASA DE DEPÓSITANTE DIRECTO","ESTADO",null,"NOMBRE DEL PAIS","SIGLA",null,"INSTITUCIÓN FINANCIERA","CÓDIGO BCE","ESTADO","CUENTA CORRIENTE EN BCE"]
[null,"CASADO","CÉDULA","AHORROS","SI","CDV ACTIVA","0992736410001",199,"HABILITADO",null,"ECUADOR","EC",null,"BANCO AMAZONAS","9","HABILITADO","1600063"]
[null,"DIVORCIADO","RUC","CORRIENTE","NO","CDV ADVFINSA","0991296468001",123,"HABILITADO",null,"AFGANISTAN","AF",null,"BANCO ATLANTIDA SA.","240","HABILITADO","2600857"]
[null,"SOLTERO","PASAPORTE",null,null,"CDV ALBION","0991301437001",110,"HABILITADO",null,"ALBANIA","AL",null,"BANCO BANECUADOR B.P.","217","HABILITADO","1410036"]
[null,"UNIÓN DE HECHO",{"$nulls":3},"CDV ANALYTICA SECURITIES ","1791277511001",106,"HABILITADO",null,"ALEMANIA","DE",null,"BANCO BOLIVARIANO C.A","31","HABILITADO","2600344"]
[null,"VIUDO",{"$nulls":3},"CDV ASESOVAL  S.A.","0993256064001",331,"HABILITADO",null,"ANDORRA","AD",null,"BANCO CAPITAL S.A.","103","HABILITADO","1600035"]
[{"$nulls":5},"CDV BANRIO","1290064313001",114,"HABILITADO",null,"ANGOLA","AO",null,"BANCO CENTRAL DEL ECUADOR","1","HABILITADO",""]
[{"$nulls":5},"CDV CENTRALCAPITAL  S.A.","1793189603001",383,"HABILITADO",null,"ANGUILA","AI",null,"BANCO CITY BANK","11","HABILITADO","1600147"]
[{"$nulls":5},"CDV ECUABURSATIL  S.A.","1791259599001",127,"HABILITADO",null,"ANTÁRTIDA","AQ",null,"BANCO COMERCIAL DE MANABI","52","HABILITADO","75600064"]
[{"$nulls":5},"CDV EQUITY  S.A.","1793199542001",398,"HABILITADO",null,"ANTIGUA Y BARBUDA","AG",null,"BANCO COOPNACIONAL S.A.","37","HABILITADO","2710218"]
[{"$nulls":5},"CDV FIDUVALOR  S.A.","1791258797001",327,"HABILITADO",null,"ANTILLAS HOLANDESAS","AN",null,"BANCO DE GUAYAQUIL S.A","28","HABILITADO","2600021"]
[{"$nulls":5},"CDV FUTURO FUTUROCAPITAL S.A.","0993229768001",328,"HABILITADO",null,"ARABIA SAUDITA","SA",null,"BANCO DE LA PRODUCCION","14","HABILITADO","1600303"]
[{"$nulls":5},"CDV INTERVALORES","0992632399001",297,"HABILITADO",null,"ARGELIA","DZ",null,"BANCO DE LOJA","49","HABILITADO","59600049"]
[{"$nulls":5},"CDV KAPITAL ONE  S.A. KAOVALSA","0991285350001",147,"HABILITADO",null,"ARGENTINA","AR",null,"BANCO DEL AUSTRO","42","HABILITADO","3600186"]
[{"$nulls":5},"CDV MASVALORES","0992309334001",117,"HABILITADO",null,"ARMENIA","AM",null,"BANCO DEL LITORAL S.A.","33","HABILITADO","2600856"]
[{"$nulls":5},"CDV MERCAPITAL  S.A","1792274796001",181,"HABILITADO",null,"ARUBA","AW",null,"BANCO DEL PACIFICO","29","HABILITADO","2600187"]
[{"$nulls":5},"CDV MERCHANTVALORES","1791268334001",116,"HABILITADO",null,"AUSTRALIA","AU",null,"BANCO DELBANK S.A.","32","HABILITADO","2600831"]
[{"$nulls":5},"CDV METROVALORES","1791274113001",187,"HABILITADO",null,"AUSTRIA","AT",null,"BANCO DESARROLLO DE LOS PUEBLOS S.A.","57","HABILITADO","1700880"]
[{"$nulls":5},"CDV ORION ","1791985648001",109,"HABILITADO",null,"AZERBAIYÁN","AZ",null,"BANCO DINERS CLUB DEL ECUADOR S A","21","HABILITADO","1700319"]
[{"$nulls":5},"CDV PICAVAL  S.A.","1791268768001",107,"HABILITADO",null,"BAHAMAS","BS",null,"BANCO GENERAL RUMINAHUI","16","HABILITADO","1600782"]
[{"$nulls":5},"CDV PLUSBURSÁTIL ","0992166150001",145,"HABILITADO",null,"BANGLADESH","BD",null,"BANCO INTERNACIONAL","13","HABILITADO","1600212"]
[{"$nulls":5},"CDV PLUSVALORES ","1792271983001",165,"HABILITADO",null,"BARBADOS","BB",null,"BANCO MACHALA","50","HABILITADO","68600014"]
[{"$nulls":5},"CDV PORTAVALOR","1791267990001",189,"DESHABILITADO",null,"BARÉIN","BH",null,"BANCO PARA LA ASISTENCIA COMUNITARIA FINCA S.A.","108","HABILITADO","1600037"]
[{"$nulls":5},"CDV PROBROKERS","1791355814001",115,"HABILITADO",null,"BÉLGICA","BE",null,"BANCO PICHINCHA C.A.","8","HABILITADO","1600022"]
[{"$nulls":5},"CDV REAL","0991277269001",151,"HABILITADO",null,"BELICE","BZ",null,"BANCO PROCREDIT S.A.","94","HABILITADO","1600491"]
[{"$nulls":5},"CDV SANTA FE","1791961021001",103,"HABILITADO",null,"BENÍN","BJ",null,"BANCO SOLIDARIO","19","HABILITADO","1600907"]
[{"$nulls":5},"CDV SILVERCROSS S.A.  SCCV.","0991276742001",129,"HABILITADO",null,"BERMUDA","BM",null,"BANCO TERRITORIAL S.A","27","HABILITADO","2600013"]
[{"$nulls":5},"CDV SMARTCAPITAL S.A. ","0993123870001",313,"HABILITADO",null,"BIELORRUSIA","BY",null,"BANCO VISIONFUND ECUADOR S. A.","245","HABILITADO","47700001"]
[{"$nulls":5},"CDV VALUE ","1791257499001",113,"HABILITADO",null,"BOLIVIA","BO",null,"COOP. 13 DE ABRIL LTDA","249","HABILITADO","20700002"]
[{"$nulls":5},"CDV VECTORGLOBAL","1792283965001",204,"HABILITADO",null,"BONAIRE, SAN EUSTAQUIO Y SABA","BQ",null,"COOP. 15 DE ABRIL LTDA","95","HABILITADO","75710004"]
[{"$nulls":5},"BANCO AMAZONAS S.A.","1790221806001",220,"HABILITADO",null,"BOSNIA Y HERZEGOVINA","BA",null,"COOP. 16 DE JULIO LTDA","222","HABILITADO","1700078"]
[{"$nulls":5},"BANCO ATLANTIDA S.A","0992701374001",206,"HABILITADO",null,"BOTSUANA","BW",null,"COOP. 23 DE JULIO","58","HABILITADO","1700885"]
[{"$nulls":5},"BANCO BANECUADOR B.P.","1768183520001",296,"HABILITADO",null,"BRASIL","BR",null,"COOP. 29 DE OCTUBRE","59","HABILITADO","1700427"]
[{"$nulls":5},"BANCO BIESS","1768156470001",154,"HABILITADO",null,"BRUNEI","BN",null,"COOP. 4 DE OCTUBRE","203","HABILITADO","79700033"]
[{"$nulls":5},"BANCO BOLIVARIANO C.A.","0990379017001",211,"HABILITADO",null,"BULGARIA","BG",null,"COOP. 9 DE OCTUBRE LTDA","91","HABILITADO","55700005"]
[{"$nulls":5},"BANCO CAPITAL S.A.","1090105244001",175,"HABILITADO",null,"BURKINA FASO","BF",null,"COOP. ACCION RURAL","109","HABILITADO","79700029"]
[{"$nulls":5},"BANCO CENTRAL DEL ECUADOR","1760002600001",122,"HABILITADO",null,"BURUNDI","BI",null,"COOP. ACCION Y DESARROLLO LTDA.","135","HABILITADO","79700030"]
[{"$nulls":5},"BANCO COMERCIAL DE MANABI S. A.","1390067506001",414,"HABILITADO",null,"BUTÁN","BT",null,"COOP. AGRICOLA JUNIN LTDA","270","HABILITADO","75700002"]
[{"$nulls":5},"BANCO COOPNACIONAL S.A.","0990459444001",369,"HABILITADO",null,"CABO VERDE","CV",null,"COOP. ALFONSO JARAMILLO C.C.C.","253","HABILITADO","3700102"]
[{"$nulls":5},"BANCO DE DESARROLLO ECUADOR B.P. (BEDE)","1760002950001",125,"HABILITADO",null,"CAMBOYA","KH",null,"COOP. ALIANZA DEL VALLE LTDA.","79","HABILITADO","1700435"]
[{"$nulls":5},"BANCO DE LOJA S A","1190002213001",212,"HABILITADO",null,"CAMERÚN","CM",null,"COOP. ALIANZA MINAS LTDA.","268","HABILITADO","1700011"]
[{"$nulls":5},"BANCO DE MACHALA S A","0790002350001",177,"HABILITADO",null,"CANADÁ","CA",null,"COOP. AMBATO LTDA.","119","HABILITADO","15703023"]
[{"$nulls":5},"BANCO DEL AUSTRO S. A","0190055965001",188,"HABILITADO",null,"CATAR","QA",null,"COOP. ANDALUCIA","23","HABILITADO","1700418"]
[{"$nulls":5},"BANCO DEL LITORAL S.A.","0990981930001",148,"HABILITADO",null,"CHAD","TD",null,"COOP. ANDINA LTDA.","134","HABILITADO","55700011"]
[{"$nulls":5},"BANCO DEL PACIFICO S.A.","0990005737001",120,"HABILITADO",null,"CHILE","CL",null,"COOP. ANTORCHA LTDA.","231","HABILITADO","37700002"]
[{"$nulls":5},"BANCO DELBANK S.A.","0990048673001",233,"HABILITADO",null,"CHINA","CN",null,"COOP. ARTESANOS LTDA.","110","HABILITADO","47700038"]
[{"$nulls":5},"BANCO DINERS CLUB DEL ECUADOR S.A.","1790283380001",222,"HABILITADO",null,"CHIPRE","CY",null,"COOP. ATUNTAQUI LTDA.","69","HABILITADO","47700037"]
[{"$nulls":5},"BANCO GENERAL RUMIÑAHUI S. A.","1790864316001",142,"HABILITADO",null,"COLOMBIA","CO",null,"COOP. CACEP COOP. EDUCADORES DE PASTAZA","205","HABILITADO","1700023"]
[{"$nulls":5},"BANCO GUAYAQUIL S.A.","0990049459001",131,"HABILITADO",null,"COMORAS","KM",null,"COOP. CACPECO LTDA","61","HABILITADO","55700010"]
[{"$nulls":5},"BANCO INTERNACIONAL S.A.","1790098354001",144,"HABILITADO",null,"COREA DEL NORTE","KP",null,"COOP. CALCETA LTDA","85","HABILITADO","75710003"]
[{"$nulls":5},"BANCO PICHINCHA CA","1790010937001",178,"HABILITADO",null,"COREA DEL SUR","KR",null,"COOP. CAMARA DE COMERCIO SANTO DOMINGO","265","HABILITADO","85700001"]
[{"$nulls":5},"BANCO PROCREDIT S.A.","1791269225001",162,"HABILITADO",null,"COSTA DE MARFIL","CI",null,"COOP. CHIBULEO","204","HABILITADO","15703040"]
[{"$nulls":5},"BANCO PRODUBANCO","1790368718001",295,"HABILITADO",null,"COSTA RICA","CR",null,"COOP. CHONE LTDA.","77","HABILITADO","75700001"]
[{"$nulls":5},"BANCO SOLIDARIO S.A.","1791109384001",174,"HABILITADO",null,"CROACIA","HR",null,"COOP. COMERCIO LTDA.","83","HABILITADO","75710001"]
[{"$nulls":5},"BANCO VISIONFUND ECUADOR S.A.","1091748041001",319,"HABILITADO",null,"CUBA","CU",null,"COOP. COMERCIO LTDA. (PORTOVIEJO)","73","HABILITADO","75710001"]
[{"$nulls":5},"BOLSA DE VALORES DE QUITO (BVQ)","1790008967001",198,"HABILITADO",null,"CURAZAO","CW",null,"COOP. COMERCIO LTDA. (PORTOVIEJO)","206","HABILITADO","75710001"]
[{"$nulls":5},"BOLSA DE VALORES GUAYAQUIL (BVG)","0990124442001",258,"HABILITADO",null,"DINAMARCA","DK",null,"COOP. COOPAC-AUSTRO LTDA. (MIESS)","227","HABILITADO","3700128"]
[{"$nulls":5},"COOP. 1 DE JULIO","1891706347001",391,"HABILITADO",null,"DOMINICA","DM",null,"COOP. COOPROGRESO LTDA.","24","HABILITADO","1700426"]
[{"$nulls":5},"COOP. 23 DE JULIO LTDA","1790093204001",217,"HABILITADO",null,"EGIPTO","EG",null,"COOP. CORPORACION CENTRO LTDA.","86","HABILITADO","1700047"]
[{"$nulls":5},"COOP. 29 DE OCTUBRE LTDA.","1790567699001",213,"HABILITADO",null,"EL SALVADOR","SV",null,"COOP. COTOCOLLAO","25","HABILITADO","1700434"]
[{"$nulls":5},"COOP. ALIANZA DEL VALLE LTDA.","1790501469001",221,"HABILITADO",null,"EMIRATOS ÁRABES UNIDOS","AE",null,"COOP. CREA LTDA (MIES)","257","HABILITADO","3700129"]
[{"$nulls":5},"COOP. ANDALUCIA LTDA.","1790325083001",214,"HABILITADO",null,"ERITREA","ER",null,"COOP. CREDI YA LTDA","273","HABILITADO","15703059"]
[{"$nulls":5},"COOP. ATUNTAQUI LTDA","1090033456001",381,"HABILITADO",null,"ESLOVAQUIA","SK",null,"COOP. CREDIAMIGO","216","HABILITADO","59700012"]
[{"$nulls":5},"COOP. CACPE DE COTOPAXI LTDA.","0590052000001",219,"HABILITADO",null,"ESLOVENIA","SI",null,"COOP. DE LA LA PEQUEÑA EMPRESA CACPE BIBLIAN LTDA.","96","HABILITADO","19700001"]
[{"$nulls":5},"COOP. CACPE DE LOJA LTDA.","1190075539001",354,"HABILITADO",null,"ESPAÑA","ES",null,"COOP. DE LA PEQ. EMP. CACPE ZAMORA LTDA.","237","HABILITADO","1700019"]
[{"$nulls":5},"COOP. CHIBULEO LTDA.","1891710328001",361,"HABILITADO",null,"ESTADOS UNIDOS (USA)","US",null,"COOP. DE LA PEQUEÑA EMPRESA DE LOJA CACPE LOJA LTDA.","122","HABILITADO","59700004"]
[{"$nulls":5},"COOP. COOPROGRESO LTDA.","1790451801001",184,"HABILITADO",null,"ESTONIA","EE",null,"COOP. DE LA PEQUEÑA EMPRESA GUALAQUIZA","266","HABILITADO","1700010"]
[{"$nulls":5},"COOP. CORPORACION CENTRO LTDA.","1791306589001",409,"HABILITADO",null,"ETIOPÍA","ET",null,"COOP. DE LOS SERV. PUBL. DEL MIN. DE EDUCACION Y CULTURA","209","HABILITADO","1700025"]
[{"$nulls":5},"COOP. CREA LTDA.","0190158977001",366,"HABILITADO",null,"FIJI","FJ",null,"COOP. DEL AZUAY","236","HABILITADO","3700137"]
[{"$nulls":5},"COOP. EL SAGRARIO LTDA","1890037646001",397,"HABILITADO",null,"FILIPINAS","PH",null,"COOP. EDUC.DEL TUNGURAHUA LTDA.","114","HABILITADO","15703022"]
[{"$nulls":5},"COOP. ERCO LTDA.","0190024733001",416,"HABILITADO",null,"FINLANDIA","FI",null,"COOP. EDUCADORES DE CHIMBORAZO","200","HABILITADO","79700031"]
[{"$nulls":5},"COOP. FERNANDO DAQUILEMA","0691706710001",342,"HABILITADO",null,"FRANCIA","FR",null,"COOP. EDUCADORES DE LOJA","210","HABILITADO","59700035"]
[{"$nulls":5},"COOP. JARDIN AZUAYO LTDA.","0190155722001",321,"HABILITADO",null,"GABÓN","GA",null,"COOP. EDUCADORES DE ZAMORA CHINCHIPE","239","HABILITADO","59700018"]
[{"$nulls":5},"COOP. JUVENTUD ECUATORIANA PROGRESISTA LTDA.","0190115798001",309,"HABILITADO",null,"GAMBIA","GM",null,"COOP. EDUCADORES DEL AZUAY","233","HABILITADO","3700146"]
[{"$nulls":5},"COOP. OSCUS LTDA.","1890001323001",312,"HABILITADO",null,"GEORGIA","GE",null,"COOP. EL MOLINO LIMITADA","272","HABILITADO","1700088"]
[{"$nulls":5},"COOP. PABLO MUÑOZ VEGA LTDA.","0490001883001",395,"HABILITADO",null,"GHANA","GH",null,"COOP. EL SAGRARIO","60","HABILITADO","15700017"]
[{"$nulls":5},"COOP. POLICIA NACIONAL LTDA","1790866084001",360,"HABILITADO",null,"GIBRALTAR","GI",null,"COOP. ERCO LTDA.","248","HABILITADO","3700123"]
[{"$nulls":5},"COOP. TULCAN LTDA.","0490002669001",400,"HABILITADO",null,"GRANADA","GD",null,"COOP. FERNANDO DAQUILEMA","262","HABILITADO","79700035"]
[{"$nulls":5},"CORPORACIÓN FINANCIERA NACIONAL (CFN)","1760003090001",104,"HABILITADO",null,"GRECIA","GR",null,"COOP. FINANZAS CORPORATIVAS LTDA","235","HABILITADO","1700054"]
[{"$nulls":5},"CORPORACIÓN NACIONAL DE FINANZAS POPULARES Y SOLIDARIAS (CONAFIPS)","1768168480001",255,"HABILITADO",null,"GROENLANDIA","GL",null,"COOP. FONDO PARA EL DESARROLLO Y LA VIDA FOND VIDA","223","HABILITADO","1700057"]
[{"$nulls":5},"CORPORACION NACIONAL DE TELECOMUNICACIONES-CNT EP","1768152560001",159,"HABILITADO",null,"GUADALUPE","GP",null,"COOP. FORTUNA (MIES)","269","HABILITADO","59700013"]
[{"$nulls":5},"ENCAJE LEGAL DCV-BCE","1760002600002","143","HABILITADO",null,"GUAM","GU",null,"COOP. FUTURO LAMANENSE","264","HABILITADO","55700030"]
[{"$nulls":5},"INSTITUTO SEGURIDAD SOCIAL DE LAS FUERZAS ARMADAS (ISSFA)","1768022190001",157,"HABILITADO",null,"GUATEMALA","GT",null,"COOP. GUARANDA LTDA.","66","HABILITADO","43700001"]
[{"$nulls":5},"MINISTERIO DE FINANZAS (MEF)","1760000900001","140","HABILITADO",null,"GUAYANA FRANCESA","GF",null,"COOP. HUAICANA LTDA","5","HABILITADO","1700029"]
[{"$nulls":5},"MUTUALISTA AZUAY","0190006247001",230,"DESHABILITADO",null,"GUERNSEY","GG",null,"COOP. INDIGENA SAC LTDA.","228","HABILITADO","15703058"]
[{"$nulls":5},"MUTUALISTA IMBABURA","1090056286001",356,"HABILITADO",null,"GUINEA","GN",null,"COOP. INTELIGENCIA DE NEGOCIOS LTDA.","70","HABILITADO","15703077"]
[{"$nulls":5},"MUTUALISTA PICHINCHA","1790075494001",215,"HABILITADO",null,"GUINEA BISSAU","GW",null,"COOP. INTI WASI LTDA. (MIES)","263","HABILITADO","59700023"]
[{"$nulls":10},"GUINEA ECUATORIAL","GQ",null,"COOP. JARDIN AZUAYO","102","HABILITADO","3700114"]
[{"$nulls":10},"GUYANA","GY",null,"COOP. JARDIN AZUAYO","226","HABILITADO","3700114"]
[{"$nulls":10},"HAITÍ","HT",null,"COOP. JUAN DE SALINAS LTDA.","141","HABILITADO","1700003"]
[{"$nulls":10},"HONDURAS","HN",null,"COOP. JUAN PIO DE MORA LTDA.","208","HABILITADO","43700002"]
[{"$nulls":10},"HONG KONG","HK",null,"COOP. JUVENTUD ECUATORIANA PROGRESISTA LTDA.","84","HABILITADO","3700113"]
[{"$nulls":10},"HUNGRÍA","HU",null,"COOP. KULLKI WASI LTDA.","7","HABILITADO","15700005"]
[{"$nulls":10},"INDIA","IN",null,"COOP. LA BENEFICA","211","HABILITADO","75700008"]
[{"$nulls":10},"INDONESIA","ID",null,"COOP. LA DOLOROSA LTDA","74","HABILITADO","2710236"]
[{"$nulls":10},"IRAK","IQ",null,"COOP. LA MERCED","212","HABILITADO","3700115"]
[{"$nulls":10},"IRÁN","IR",null,"COOP. LA UNIÓN LTDA. (MIES)","6","HABILITADO","75700007"]
[{"$nulls":10},"IRLANDA","IE",null,"COOP. LAS NAVES","267","HABILITADO","43700014"]
[{"$nulls":10},"ISLA BOUVET","BV",null,"COOP. LUCHA CAMPESINA","201","HABILITADO","79700037"]
[{"$nulls":10},"ISLA DE MAN","IM",null,"COOP. LUZ DEL VALLE","247","HABILITADO","1700043"]
[{"$nulls":10},"ISLA DE PASCUA","CX",null,"COOP. MANANTIAL DE ORO LTDA.","133","HABILITADO","1700002"]
[{"$nulls":10},"ISLA NORFOLK","NF",null,"COOP. MANUEL ESTEBAN GODOY ORTEGA LTDA. COOPMEGO","78","HABILITADO","59700001"]
[{"$nulls":10},"ISLANDIA","IS",null,"COOP. MAQUITA CUSHUNCHIC LTDA.","261","HABILITADO","1700032"]
[{"$nulls":10},"ISLAS CAIMÁN","KY",null,"COOP. MICROEMPRESARIAL SUCRE","202","HABILITADO","26700001"]
[{"$nulls":10},"ISLAS COCOS","CC",null,"COOP. MUJERES UNIDAS TANTANAKUSHKA WARMIKUNAPAK CACMU LTDA.","117","HABILITADO","47700040"]
[{"$nulls":10},"ISLAS COOK","CK",null,"COOP. MUSHUC RUNA LTDA.","112","HABILITADO","15703021"]
[{"$nulls":10},"ISLAS DE ÅLAND","AX",null,"COOP. NUEVA ESPERANZA LTDA.","213","HABILITADO","79700001"]
[{"$nulls":10},"ISLAS FAROE","FO",null,"COOP. NUEVA HUANCAVILCA LTDA.","243","HABILITADO","2700001"]
[{"$nulls":10},"ISLAS GEORGIA DEL SUR Y SANDWICH DEL SUR","GS",null,"COOP. ONCE DE JUNIO","92","HABILITADO","68700054"]
[{"$nulls":10},"ISLAS HEARD Y MCDONALD","HM",null,"COOP. OSCUS","64","HABILITADO","15700001"]
[{"$nulls":10},"ISLAS MALVINAS","FK",null,"COOP. PABLO MUÑOZ VEGA.","67","HABILITADO","89700001"]
[{"$nulls":10},"ISLAS MARIANAS DEL NORTE","MP",null,"COOP. PADRE JULIAN LORENTE LTDA.","90","HABILITADO","59700003"]
[{"$nulls":10},"ISLAS MARSHALL","MH",null,"COOP. PEDRO MONCAYO LTDA.","136","HABILITADO","1700428"]
[{"$nulls":10},"ISLAS MENORES ALEJADAS DE LOS ESTADOS UNIDOS","UM",null,"COOP. PEQUEÑA EMPRESA PASTAZA","72","HABILITADO","1700419"]
[{"$nulls":10},"ISLAS PITCAIRN","PN",null,"COOP. PILAHUIN TIO LTDA","255","HABILITADO","1700028"]
[{"$nulls":10},"ISLAS SALOMÓN","SB",null,"COOP. POLICIA NACIONAL LTDA.","124","HABILITADO","1700511"]
[{"$nulls":10},"ISLAS SVALBARD Y JAN MAYEN","SJ",null,"COOP. PREVISION AHORRO Y DESARROLLO","65","HABILITADO","1700417"]
[{"$nulls":10},"ISLAS TOKELAU","TK",null,"COOP. PUELLARO LTDA","252","HABILITADO","1700004"]
[{"$nulls":10},"ISLAS TURCOS Y CAICOS","TC",null,"COOP. PUERTO LOPEZ LTDA.","271","HABILITADO","75700003"]
[{"$nulls":10},"ISLAS VÍRGENES BRITÁNICAS","VG",null,"COOP. RIOBAMBA","53","HABILITADO","79700027"]
[{"$nulls":10},"ISLAS VÍRGENES DE LOS EE.UU.","VI",null,"COOP. SAN ANTONIO LTDA.","259","HABILITADO","20700003"]
[{"$nulls":10},"ISRAEL","IL",null,"COOP. SAN ANTONIO LTDA. - IMBABURA (MIES)","260","HABILITADO","47700041"]
[{"$nulls":10},"ITALIA","IT",null,"COOP. SAN FRANCISCO","46","HABILITADO","15700040"]
[{"$nulls":10},"JAMAICA","JM",null,"COOP. SAN FRANCISCO DE ASIS LTDA.","98","HABILITADO","1700886"]
[{"$nulls":10},"JAPÓN","JP",null,"COOP. SAN GABRIEL LTDA.","118","HABILITADO","89700036"]
[{"$nulls":10},"JERSEY","JE",null,"COOP. SAN JOSE LTDA.","97","HABILITADO","43700010"]
[{"$nulls":10},"JORDANIA","JO",null,"COOP. SAN MIGUEL DE LOS BANCOS","120","HABILITADO","1700510"]
[{"$nulls":10},"KAZAJISTÁN","KZ",null,"COOP. SANTA ANA LTDA.","81","HABILITADO","75710002"]
[{"$nulls":10},"KENIA","KE",null,"COOP. SANTA ANITA LTDA.","115","HABILITADO","47700039"]
[{"$nulls":10},"KIRGUISTÁN","KG",null,"COOP. SANTA ISABEL LTDA","214","HABILITADO","3700135"]
[{"$nulls":10},"KIRIBATI","KI",null,"COOP. SANTA ROSA LTDA.","93","HABILITADO","68700055"]
[{"$nulls":10},"KOSOVO","XK",null,"COOP. SANTIAGO LTDA","251","HABILITADO","59700034"]
[{"$nulls":10},"KUWAIT","KW",null,"COOP. SEMILLA DEL PROGRESO LTDA.","234","HABILITADO","59700006"]
[{"$nulls":10},"LAOS","LA",null,"COOP. SEÑOR DE GIRÓN","254","HABILITADO","3700120"]
[{"$nulls":10},"LESOTO","LS",null,"COOP. TENA LTDA.","215","HABILITADO","1700009"]
[{"$nulls":10},"LETONIA","LV",null,"COOP. TULCAN","63","HABILITADO","89700035"]
[{"$nulls":10},"LÍBANO","LB",null,"COOP. UNIFAM LTDA. EN LIQUIDACION","38","HABILITADO","2710234"]
[{"$nulls":10},"LIBERIA","LR",null,"COOP. UNION EL EJIDO","246","HABILITADO","47700046"]
[{"$nulls":10},"LIBIA","LY",null,"COOP. VISION DE LOS ANDES VISANDES","250","HABILITADO","55700001"]
[{"$nulls":10},"LIECHTENSTEIN","LI",null,"CORPORACION FINANCIERA","4","HABILITADO","1500057"]
[{"$nulls":10},"LITUANIA","LT",null,"MUTUALISTA AMBATO","45","HABILITADO","15700016"]
[{"$nulls":10},"LUXEMBURGO","LU",null,"MUTUALISTA AZUAY","43","HABILITADO","3700028"]
[{"$nulls":10},"MACAO","MO",null,"MUTUALISTA IMBABURA","48","HABILITADO","47700018"]
[{"$nulls":10},"MACEDONIA","MK",null,"MUTUALISTA PICHINCHA","20","HABILITADO","1700012"]
[{"$nulls":10},"MADAGASCAR","MG"]
[{"$nulls":10},"MALASIA","MY"]
[{"$nulls":10},"MALAUI","MW"]
[{"$nulls":10},"MALDIVAS","MV"]
[{"$nulls":10},"MALÍ","ML"]
[{"$nulls":10},"MALTA","MT"]
[{"$nulls":10},"MARRUECOS","MA"]
[{"$nulls":10},"MARTINICA","MQ"]
[{"$nulls":10},"MAURICIO","MU"]
[{"$nulls":10},"MAURITANIA","MR"]
[{"$nulls":10},"MAYOTTE","YT"]
[{"$nulls":10},"MÉXICO","MX"]
[{"$nulls":10},"MICRONESIA","FM"]
[{"$nulls":10},"MOLDAVIA","MD"]
[{"$nulls":10},"MÓNACO","MC"]
[{"$nulls":10},"MONGOLIA","MN"]
[{"$nulls":10},"MONTENEGRO","ME"]
[{"$nulls":10},"MONTSERRAT","MS"]
[{"$nulls":10},"MOZAMBIQUE","MZ"]
[{"$nulls":10},"MYANMAR","MM"]
[{"$nulls":10},"NAMIBIA","NA"]
[{"$nulls":10},"NAURU","NR"]
[{"$nulls":10},"NEPAL","NP"]
[{"$nulls":10},"NICARAGUA","NI"]
[{"$nulls":10},"NÍGER","NE"]
[{"$nulls":10},"NIGERIA","NG"]
[{"$nulls":10},"NIUE","NU"]
[{"$nulls":10},"NORUEGA","NO"]
[{"$nulls":10},"NUEVA CALEDONIA","NC"]
[{"$nulls":10},"NUEVA ZELANDA","NZ"]
[{"$nulls":10},"OMÁN","OM"]
[{"$nulls":10},"PAÍSES BAJOS","NL"]
[{"$nulls":10},"PAKISTÁN","PK"]
[{"$nulls":10},"PALAOS","PW"]
[{"$nulls":10},"PANAMÁ","PA"]
[{"$nulls":10},"PAPÚA NUEVA GUINEA","PG"]
[{"$nulls":10},"PARAGUAY","PY"]
[{"$nulls":10},"PERÚ","PE"]
[{"$nulls":10},"POLINESIA FRANCESA","PF"]
[{"$nulls":10},"POLONIA","PL"]
[{"$nulls":10},"PORTUGAL","PT"]
[{"$nulls":10},"PUERTO RICO","PR"]
[{"$nulls":10},"REINO UNIDO","GB"]
[{"$nulls":10},"REPÚBLICA CHECA","CZ"]
[{"$nulls":10},"REPÚBLICA DE ÁFRICA CENTRAL","CF"]
[{"$nulls":10},"REPÚBLICA DEL CONGO","CG"]
[{"$nulls":10},"REPÚBLICA DEMOCRÁTICA DEL CONGO","CD"]
[{"$nulls":10},"REPÚBLICA DOMINICANA","DO"]
[{"$nulls":10},"REPÚBLICA TOGOLESA","TG"]
[{"$nulls":10},"REUNIÓN","RE"]
[{"$nulls":10},"RUANDA","RW"]
[{"$nulls":10},"RUMANÍA","RO"]
[{"$nulls":10},"RUSIA","RU"]
[{"$nulls":10},"SAHARA OCCIDENTAL","EH"]
{"$rows_left_out":55}